{"text_format":"1","workbook":"xlsx","n_sheets":7,"sheets":["Manual","INICIO","Formato","Emisión-Inclusión masiva","Inclusión masiva","Endosos Múltiples","Hoja2"],"not_rendered":{"charts":0,"images":15,"macros":1,"external_links":0,"defined_names":18,"comments":1,"pivot_tables":0},"unopened":[],"bounds":{"document_bytes":16777216,"sheet_cells":100000,"rows_first":2000,"rows_last":500,"rows_between":2000,"halvings":0,"cell_chars":16384,"cell_head_chars":4096},"cells_cut":0,"cells_raw":0,"read":"row_number_cap","date_system":"1900"}

{"sheet":"Manual","index":0,"n_rows":31,"n_cols":4,"rows_kept":31,"cut":false,"hidden":false,"merged":[[0,0,1,11],[26,0,27,11],[30,0,30,2],[30,3,30,10]]}
["Manual de instrucciones para el uso del formato de solicitudes vehiculares"]
[]
[]
[]
[]
[]
[]
[]
[]
[]
[]
[]
[]
[]
[]
[]
[]
[]
[]
[]
[]
[]
[]
[]
[]
[]
["Glosario"]
[]
["1. Operación Autogestionable:",null,null,"Son aquellas operaciones que el corredor puede realizar a través de la plataforma SAS NB&R"]
[]
["2. Operación Autogestionable\n      con validación:",null,null,"Son aquellas operaciones que  el corredor puede realizar a través de la plataforma SAS NB&R  con un flujo de validación o aprobación interna (Vb°) "]

{"sheet":"INICIO","index":1,"n_rows":13,"n_cols":14,"rows_kept":13,"cut":false,"hidden":false,"merged":[[4,2,5,12]]}
[]
[]
[]
[]
[null,null,"Escoja la operación que desea realizar"]
[]
[]
[]
[]
[]
[]
[]
[null,null,null,null,null,null,null,null,null,null,null,null,null," "]

{"sheet":"Formato","index":2,"n_rows":125,"n_cols":16,"rows_kept":125,"cut":false,"hidden":true,"merged":[[120,1,120,2],[120,3,120,4],[121,1,121,2],[121,3,121,4],[122,1,122,2],[122,3,122,4],[123,1,123,2],[123,3,123,4],[124,1,124,2],[124,3,124,4],[114,1,114,4],[115,1,115,4],[116,1,116,2],[116,3,116,4],[117,1,117,2],[117,3,117,4],[118,1,118,2],[118,3,118,4],[119,1,119,2],[119,3,119,4],[98,1,102,4],[105,1,109,4],[111,0,111,5],[7,1,9,5],[11,0,11,5],[12,1,12,4],[13,1,13,2],[14,1,14,2],[15,1,15,2],[19,1,19,2],[29,0,39,0],[29,1,29,4],[29,5,39,5],[30,1,30,4],[31,1,31,2],[31,3,31,4],[32,1,32,2],[32,3,32,4],[33,1,33,2],[33,3,33,4],[37,1,37,2],[37,3,37,4],[38,1,38,2],[38,3,38,4],[0,0,4,5],[5,1,6,5],[5,0,6,0],[10,0,10,5],[7,0,9,0],[24,1,24,2],[24,3,24,4],[27,0,27,5],[28,0,28,5],[20,1,21,2],[22,1,23,2],[14,3,14,4],[19,3,19,4],[21,3,21,4],[17,1,17,2],[18,1,18,2],[16,3,16,4],[17,3,17,4],[18,3,18,4],[25,1,25,2],[26,1,26,2],[15,3,15,4],[45,1,45,2],[45,3,45,4],[52,1,52,2],[52,3,52,4],[39,1,39,2],[39,3,39,4],[34,1,34,2],[34,3,34,4],[35,1,35,2],[35,3,35,4],[36,1,36,2],[36,3,36,4],[46,1,46,2],[46,3,46,4],[54,0,55,0],[54,1,54,2],[54,3,54,4],[54,5,55,5],[55,1,55,2],[55,3,55,4],[49,1,49,2],[49,3,49,4],[50,1,50,2],[50,3,50,4],[51,1,51,2],[51,3,51,4],[41,5,52,5],[47,1,47,2],[47,3,47,4],[48,1,48,2],[48,3,48,4],[41,0,52,0],[41,1,41,2],[41,3,41,4],[42,1,42,4],[43,1,43,4],[44,1,44,2],[44,3,44,4],[56,0,56,5],[57,0,66,0],[57,1,57,4],[57,5,66,5],[58,1,58,2],[58,3,58,4],[59,1,59,2],[59,3,59,4],[60,1,60,2],[60,3,60,4],[64,1,64,2],[64,3,64,4],[65,3,65,4],[66,1,66,2],[66,3,66,4],[78,2,78,4],[79,2,79,4],[91,1,91,4],[68,0,74,0],[68,1,68,4],[61,1,61,2],[61,3,61,4],[62,1,62,2],[62,3,62,4],[63,1,63,2],[63,3,63,4],[80,0,81,0],[80,1,81,4],[86,1,86,2],[87,1,87,2],[94,3,94,4],[97,2,97,4],[104,2,104,4],[92,1,93,4],[95,0,95,5],[16,1,16,2],[25,3,25,4],[88,1,88,2],[88,3,88,4],[89,1,89,2],[89,3,89,4],[90,1,90,2],[90,3,90,4],[84,1,84,4],[85,1,85,4],[86,3,86,4],[87,3,87,4],[80,5,81,5],[83,0,91,0],[83,2,83,4],[68,5,74,5],[76,0,79,0],[77,2,77,4],[77,5,79,5]]}
[]
[]
[]
[]
[]
[null," Solicitud Vehicular Individual"]
[]
[null,"Recuerda que la mayoría de  operaciones son autogestionables a través de la Plataforma SAS NB&R. Podrás identificar la operación,  al seleccionar el tipo de endoso. Si necesitas soporte operativo comunícate con atencionvirtual@rimac.com.pe\nDescarga el manual instructivo "]
[null,null,null,null,null,null,null,null,"Asunto"]
[null,null,null,null,null,null,null,null,{"$f":"I121&\" \"&\"/  \"&VLOOKUP(H16,Hoja2!$A$11:$C$18,3,0)&\"  /  \"&D15&\" - \"&IF(H16=2,\"\",D25)&IF(OR(H16=1,H16=2,H16=5,H16=7),\" \",\" -\"&D26)&\" / Corredor : \"&D20","v":"- - , - /  Emisión de Póliza Nueva  /  2101 -   / Corredor : -"}]
[]
[null,null,null,null,null,null,null,"Emisión de Póliza Nueva"]
[null,"INFORMACIÓN PRELIMINAR:"]
[null,"Producto:"]
[null,"Código de producto",null,{"$f":"VLOOKUP(producto,Hoja2!A3:C7,3,0)","v":2101},null,null,null,1,2,3,4,5,6,7,8]
[null,"Tipo de Endoso",null,{"$f":"+H12","v":"Emisión de Póliza Nueva"},null,null,null,{"$f":"VLOOKUP(D16,Hoja2!B11:E18,4,0)","v":2},{"$f":"D24-TODAY()","v":-43494},{"$f":"IF(I16=0,\"\",\"Recuerde que su solicitud es una Emisión Retroactiva , la cuál pasará por un flujo de aprobación. \")","v":"Recuerde que su solicitud es una Emisión Retroactiva , la cuál pasará por un flujo de aprobación. "}]
[null,"Tipo de Endoso",null,null,null,null,null,1]
[null,"Tipo de Endoso",null,null,null,null,null,15]
[null,"Tipo de Endoso"]
[null,{"$f":"IF(D20=\"\",\"Corredor: *.\",\"Corredor:\")","v":"Corredor:"},null,"-"]
[null,{"$f":"IF(D22=\"\",\"Plan de emisión:*.\",\"Plan de emisión:\")","v":"Plan de emisión:"}]
[null,null,null,"Especifique"]
[null,{"$f":"IF(OR(H16=1,H16=4,H16=3),\"Vigencia de Endoso:\",IF(OR(D24=\"\",E24=\"\"),\"Vigencia de Póliza:*.\",\"Vigencia de Póliza:\"))","v":"Vigencia de Póliza:*."},null,{"$f":"IF(OR(H17=17,H17=18),\"Fecha de Rehabilitación\",IF(H17=9,\"Inicio de Prórroga\",IF(H17=10,\"Inicio de Prórroga\",IF(H16=4,\"Fecha de Exclusión\",IF(H16=1,\"Fecha de Anulación\",IF(H16=3,\"Inicio de vigencia de endoso\",IF(D24=\"\",\"Inicio de Vigencia *.\",\"Inicio de Vigencia \")))))))","v":"Inicio de Vigencia *."},{"$f":"IF(N55=2,\"Fin de Vigencia \",IF(H17=9,\"Fin  de Prórroga\",IF(H17=10,\"Fin de Prórroga\",IF(E24=\"\",\"Fin de Vigencia :*.\",\"Fin de Vigencia \"))))","v":"Fin de Vigencia "}]
[null,null,null,null,{"$f":"D24+365","v":"1900-12-30"},null,null,{"$f":"E24=H28","v":true}]
[null,{"$f":"IF(D25=\"\", \"Nro de Póliza:*.\",\"Nro de Póliza:\")","v":"Nro de Póliza:"},null,"Ingrese Nro de Póliza"]
[null,{"$f":"IF(D26=\"\", \"Nro de Certificado:*.\",\"Nro de Certificado:\")","v":"Nro de Certificado:"},null,"Ingrese Nro de Certificado"]
[null,"Poliza Endosada:",null,null,null,null,2,null,null,null,null,false,{"$f":"IF(L27=FALSE,\"1\",\"2\")","v":"1"}]
[null,null,null,null,null,null,null,"1900-12-30",null,null,null,false,{"$f":"IF(L28=FALSE,\"1\",\"2\")","v":"1"}]
[null,null,null,null,null,null,null,null,null,null,null,false,{"$f":"IF(L29=FALSE,\"1\",\"2\")","v":"1"}]
[null,"DATOS GENERALES"]
[null,"Contratante"]
[null,"Tipo de Documento:",null,null,null,null,null,null,1]
[null,{"$f":"IF(D33=\"\",\"Nro de Documento:*.\",\"Nro de Documento:\")","v":"Nro de Documento:"},null,"-"]
[null,{"$f":"IF(D34=\"\",\"Apellido Paterno:*.\",\"Apellido Paterno:\")","v":"Apellido Paterno:"},null,"-",null,null,null,null,{"$f":"IF(OR(I32=1,I32=3,I32=4),D34&\" \"&D35&\" , \"&D36,D37)","v":"- - , -"}]
[null,{"$f":"IF(D35=\"\",\"Apellido Materno:*.\",\"Apellido Materno:\")","v":"Apellido Materno:"},null,"-"]
[null,{"$f":"IF(D36=\"\",\"Nombres Completos:*.\",\"Nombres Completos:\")","v":"Nombres Completos:"},null,"-"]
[null,{"$f":"IF(D37=\"\",\"Razón Social:*.\",\"Razón Social:\")","v":"Razón Social:"},null,"-"]
[null,{"$f":"IF(D38=\"\",\"Correo Electrónico:*.\",\"Correo Electrónico:\")","v":"Correo Electrónico:"},null,"-"]
[null,{"$f":"IF(D39=\"\",\"Teléfono:*.\",\"Teléfono:\")","v":"Teléfono:"},null,"-"]
[null,{"$f":"IF(D40=\"\",\"Dirección:*.\",\"Dirección:\")","v":"Dirección:"},null,"-"]
[]
[null,"El asegurado es igual al contratante :",null,null,null,null,null,null,1]
[]
[null,"Asegurado"]
[null,"Tipo de Documento:",null,null,null,null,null,null,1]
[null,{"$f":"IF(D46=\"\",\"Nro de Documento:*.\",\"Nro de Documento:\")","v":"Nro de Documento:"},null,"-",null,null,null,null,{"$f":"IF(OR(I45=1,I45=3,I45=4),D47&\" \"&D48&\" , \"&D49,D50)","v":"- - , -"}]
[null,{"$f":"IF(D47=\"\",\"Apellido Paterno:*.\",\"Apellido Paterno:\")","v":"Apellido Paterno:"},null,"-"]
[null,{"$f":"IF(D48=\"\",\"Apellido Materno:*.\",\"Apellido Materno:\")","v":"Apellido Materno:"},null,"-"]
[null,{"$f":"IF(D49=\"\",\"Nombres Completos:*.\",\"Nombres Completos:\")","v":"Nombres Completos:"},null,"-"]
[null,{"$f":"IF(D50=\"\",\"Razón Social:*.\",\"Razón Social:\")","v":"Razón Social:"},null,"-"]
[null,{"$f":"IF(D51=\"\",\"Correo Electrónico:*.\",\"Correo Electrónico:\")","v":"Correo Electrónico:"},null,"-"]
[null,{"$f":"IF(D52=\"\",\"Teléfono:*.\",\"Teléfono:\")","v":"Teléfono:"},null,"-"]
[null,{"$f":"IF(D53=\"\",\"Dirección:*.\",\"Dirección:\")","v":"Dirección:"},null,"-"]
[null,null,null,null,null,null,null,null,1]
[null,"El responsable de pago es igual al contratante:",null,null,null,null,null,null,1]
[null,"El responsable de pago es igual al asegurado:"]
[]
[null,"Responsable de Pago"]
[null,"Tipo de Documento:",null,null,null,null,null,null,1]
[null,{"$f":"IF(D60=\"\",\"Nro de Documento:*.\",\"Nro de Documento:\")","v":"Nro de Documento:"},null,"-",null,null,null,null,{"$f":"IF(OR(I59=1,I59=3,I59=4),D61&\" \"&D62&\" , \"&D63,D64)","v":"- - , -"}]
{"$rows_left_out":66}
{"sheet":"Emisión-Inclusión masiva","index":3,"n_rows":158,"n_cols":29,"rows_kept":158,"cut":false,"hidden":true,"merged":[[150,26,155,28],[156,6,156,8],[156,9,156,11],[156,12,156,20],[156,23,156,25],[156,26,156,28],[79,6,79,8],[79,9,79,11],[79,12,79,20],[79,23,79,25],[79,26,79,28],[73,1,73,2],[59,12,59,20],[53,26,58,28],[2,1,2,2],[51,1,51,2],[73,26,78,28],[1,1,1,2],[59,6,59,8],[59,9,59,11],[59,23,59,25],[59,26,59,28],[41,1,42,2],[12,1,12,2],[3,26,8,28],[9,23,9,25],[9,12,9,20],[9,6,9,8],[9,9,9,11],[9,26,9,28],[95,26,95,27],[96,26,96,27],[97,26,97,27],[98,26,98,27],[99,26,99,27],[100,26,100,27],[101,26,101,27],[102,26,102,27],[103,26,103,27],[104,26,104,27]]}
[]
[null,"Para este tipo de operación deberá seleccionar la opción que desea solicitar:"]
[null,"Solicitud de emisión de 2 unidades a más"]
[]
[null,"Producto:",{"$f":"VLOOKUP(producto,Hoja2!A3:B7,2,0)","v":"Daño Propio"}]
[null,"Código de Producto :",{"$f":"+Formato!D15","v":2101}]
[null,"Corredor:"]
[]
[1,"Plan de emisión:"]
[2,null,null,null,null,null,"Datos del Asegurado",null,null,"Datos del Responsable de pago",null,null,"Datos del vehículo",null,null,null,null,null,null,null,null,null,null,"Inspección",null,null,"Financiamiento"]
[0,"Tipo de Impresión:","Seleccione",null,"Inicio de vigencia","Fin de vigencia","Nombre de \nAsegurado","Tipo de Documento","Nro Doc","Nombre del Responsable de Pago","Tipo de Documento","Nro Doc","Tipo y Clase \nde Vh.","Marca","Modelo","Año","Placa","Motor","Serie","Uso","Suma Aseg.","Color","Endosatario","Nombre de Contacto","Telefono de contacto","Correo electrónico","Forma de Pago","Nro de cuotas","Nro de Pago fácil"]
[]
[null,"Contratante"]
[null,"Tipo de Documento:"]
[null,"Nro de Documento:"]
[null,"Nombre y apellidos / Razón social:"]
[null,"Correo Electrónico:"]
[null,"Teléfono:"]
[false,"Dirección:"]
[]
[null,"El contratante es igual al asegurado y responsable de pago :",null,null,null,null,{"$f":"IF(A11=2,\" -> Se añadio la columna G (Asegurado y Responsable de pago) en tabla de datos \",\"\")","v":""}]
[false]
[null,"Los certificados tienen el mismo inicio de vigencia y fin de vigencia: ",null,null," -> Se añadio la columna E  ( Inicio  y fin de vigencia) en tabla de datos"]
[false]
[{"$f":"VLOOKUP(A24,$B$32:$C$33,2,0)","v":2},"Inicio de Vigencia :"]
[false,"Fin de Vigencia :"]
[{"$f":"VLOOKUP(A26,$B$32:$C$33,2,0)","v":2},"Escoja los campos complementarios que desea añadir :",null,null,null,null,{"$f":"IF(A26=TRUE,\" -> Se añadio la columna W (endosatario) en tabla de datos\",\"\")","v":""}]
[true,null,null,null,null,null,{"$f":"IF(A24=TRUE,\" -> Se añadio la columna V (color) en tabla de datos \",\"\")","v":""}]
[{"$f":"VLOOKUP(A28,$B$32:$C$33,2,0)","v":1}]
[true,"Tipo de financiamiento"]
[{"$f":"VLOOKUP(A30,$B$32:$C$33,2,0)","v":1}]
[null,true,1]
[null,false,2]
[]
[]
[]
[]
[]
[null,"Tipo de Cobro :",null,{"$f":"IF(OR(B90=3,B90=4),\" -> Se añadio la columna AA (Financiamiento) en tabla de datos \",\"\")","v":""}]
[null,"Forma de pago :",null,1]
[null,{"$f":"IF(C40=\"Cargo en cuenta\",\"Cantidad de cuotas y Nro de Pago Fácil :\",\"Cantidad de cuotas :\")","v":"Cantidad de cuotas :"}]
[null,{"$f":"IF(D40=4,\"Si la Forma de Pago fuera con Cargo en Cuenta, deberá solicitar su número de pago fácil a cobranzas : cargoautomatico.cobranza@rimac.com.pe \",\"\")","v":""}]
[]
[]
[null,"Inspección"]
[null,"Datos de la inspección:",null,{"$f":"IF(C89=3,\" -> Se añadio la columna X (Inspección) en tabla de datos \",\"\")","v":""}]
[null,"Nombre de Contacto :"]
[null,"Telefono de contacto :"]
[null,"Correo electrónico :"]
[]
[]
[null,"Solicitud de inclusión de 2 unidades a más"]
[null,"Seleccione","Un documento de cobro por todos los certificados"]
[null,"Producto:",{"$f":"VLOOKUP(producto,Hoja2!A3:B7,2,0)","v":"Daño Propio"}]
[null,"Código de Producto :",{"$f":"+Formato!D15","v":2101}]
[null,"Corredor:",{"$f":"+C7","v":0}]
[null,"Nro de Póliza"]
[null,"Plan:"]
[null,"Tipo de Impresión:","Seleccione"]
[1,"Los certificados tienen el mismo inicio de vigencia: "]
{"$rows_left_out":99}
{"sheet":"Inclusión masiva","index":4,"n_rows":44,"n_cols":28,"rows_kept":44,"cut":false,"hidden":true,"merged":[[9,25,9,27],[24,1,25,2],[1,1,2,2],[9,22,9,24],[9,11,9,19],[9,8,9,10],[9,5,9,7]]}
[]
[null,"Solicitud de inclusión de 2 unidades a más"]
[]
[null,null,null,null,null,null,"Seleccione"]
[null,"Producto:",{"$f":"VLOOKUP(producto,Hoja2!A3:B7,2,0)","v":"Daño Propio"},null,null,null,"Un documento de cobro por todos los certificados"]
[null,"Código de Producto :",{"$f":"+Formato!D15","v":2101},null,null,null,"Un documento de cobro por cada certificado"]
[null,"Corredor:",null,null,null,null,"Un documento de cobro por responsable de pago"]
[null,"Nro de Póliza"]
[null,"Inicio de Vigencia :"]
[2,null,null,null,null,"Datos del Asegurado",null,null,"Datos del Responsable de pago",null,null,"Datos del vehículo",null,null,null,null,null,null,null,null,null,null,"Inspección",null,null,"Financiamiento"]
[1,"Plan:",null,null,"Inicio de vigencia","Nombre de \nAsegurado","Tipo de Documento","Nro Doc","Nombre del Responsable de Pago","Tipo de Documento","Nro Doc","Tipo y Clase \nde Vh.","Marca","Modelo","Año","Placa","Motor","Serie","Uso","Suma Aseg.","Color","Endosatario","Nombre de Contacto","Telefono de contacto","Correo electrónico","Forma de Pago","Nro de cuotas","Nro de Pago fácil"]
[1,"Tipo de Cobro:","Seleccione"]
[]
[null,"Los certificados tienen el mismo inicio de vigencia: "]
[null,null,null,2]
[null,"El asegurado es igual al  responsable de pago :",null,1]
[]
[null,"Escoja los campos complementarios que desea añadir :"]
[false]
[{"$f":"VLOOKUP(A19,B43:C44,2,0)","v":2}]
[null,"Tipo de financiamiento"]
[false,"Tipo de Cobro :"]
[{"$f":"VLOOKUP(A22,B43:C44,2,0)","v":2},"Forma de pago :",null,4]
[null,{"$f":"IF(C23=\"Cargo en cuenta\",\"Cantidad de cuotas y Nro de Pago Fácil :\",\"Cantidad de cuotas :\")","v":"Cantidad de cuotas :"}]
[null,{"$f":"IF(D23=4,\"Si la Forma de Pago fuera con Cargo en Cuenta, deberá solicitar su número de pago fácil a cobranzas :  cargoautomatico.cobranza@rimac.com.pe \",\"\")","v":"Si la Forma de Pago fuera con Cargo en Cuenta, deberá solicitar su número de pago fácil a cobranzas :  cargoautomatico.cobranza@rimac.com.pe "}]
[]
[null,"Inspección"]
[null,"Datos de la inspección:"]
[null,"Nombre de Contacto :"]
[null,"Telefono de contacto :"]
[null,"Correo electrónico :"]
[]
[null,null,"Seleccione"]
[null,"Seleccione"]
[null,"Contado"]
[null,"Cargo en cuenta"]
[null,"Cupones",1]
[]
[null,null,"Seleccione"]
[null,1,"Aplica para toda la póliza"]
[null,null,"Aplica por cada certificado"]
[]
[null,true,1]
[null,false,2]

{"sheet":"Endosos Múltiples","index":5,"n_rows":20,"n_cols":14,"rows_kept":20,"cut":false,"hidden":true,"merged":[[9,0,11,4],[15,0,17,4],[7,0,7,1],[7,2,7,4],[1,0,2,30],[4,0,4,1],[4,2,4,4],[5,0,5,1],[5,2,5,4],[6,0,6,1],[6,2,6,4],[4,5,5,8],[13,0,13,1],[13,2,13,4]],"read":"row_number_cap"}
[]
["Solicitud de endosos varios"]
[]
[]
["Producto (*) :",null,{"$f":"VLOOKUP(producto,Hoja2!A3:B7,2,0)","v":"Daño Propio"}]
["Código de Producto (*) :",null,{"$f":"VLOOKUP(producto,Hoja2!A3:C7,3,0)","v":2101}]
["Corredor:"]
["Tipo de endoso:",null,null,null,null,null,null,2,2,null,null,null,null,2]
[]
["Recuerda que para esta opción, puedes solicitar la modificación de los siguientes datos:\n- Placa, motor, serie.                                                    - Suma asegurada, Nro de Ocupantes.\n- Tipo, clase, marca, modelo.                                     -Año de vehículo, color,  uso.\n-Cláusula, cobertura y deducible.                              - Contratante,Asegurado y responsable de pago*\n -Endosatario                                                                 *Para este caso se deberá indicar el nro de dcto\n"]
[]
[]
[]
["Desea añadir texto :",null,null,null,null,null,null,null,2,null,null,"Si"]
[null,null,null,null,null,null,null,null,null,null,null,"No"]
["Ingrese aquí el texto"]
[]
[]
[]
["Póliza",{"$f":"IF(I8=3,\"Póliza\",\"Certificado\")","v":"Certificado"},{"$f":"IF(I8=3,\"Fecha de anulación\",IF(I8=4,\"Fecha de exclusión\",\"Dato a modificar\"))","v":"Dato a modificar"},"Dice",{"$f":"IF(OR(I8=3,I8=4),\"Fin de Prórroga\",\"Debe decir\")","v":"Debe decir"}]

{"sheet":"Hoja2","index":6,"n_rows":94,"n_cols":9,"rows_kept":94,"cut":false,"hidden":true,"merged":[]}
["Producto",1,null,null,null,"PLAN",1]
[]
[1,"Daño Propio",2101,null,null,1,"Modular"]
[2,"Brevete",2010,null,null,2,"Corporativa"]
[3,"Responsabilidad Civil - TPU",2016,null,null,3,"Colectiva"]
[4,"Traslados",2014]
[5,"Exhibición de Placas",2015]
[]
[]
["Tipo de Solicitud",{"$f":"+Formato!H16","v":2},null,null,null,"Tipo de Endoso",1,7,16]
[1,"Anulación","Anulación","Autogestionable",1]
[2,"Emisión de Póliza Nueva","Emisión de Póliza Nueva",{"$f":"IF(Formato!I16=0,\"Autogestionable\",\"Operación back\")","v":"Operación back"},2]
[3,"Endoso",{"$f":"\"Endoso : \"&VLOOKUP(Formato!H17,Hoja2!F13:G31,2,0)","v":"Endoso : _Seleccione_"},{"$f":"IF((VLOOKUP(Formato!H17,F13:I31,4,0))=0,\" \",(VLOOKUP(Formato!H17,F13:I31,4,0)))","v":"Operación back"},3,1,"_Seleccione_",{"$f":"\"Endoso de \"&G13","v":"Endoso de _Seleccione_"},"Operación back"]
[4,"Exclusión","Exclusión","Autogestionable",4,2,"Cambio de Asegurado/Contratante/Responsable de Pago",{"$f":"\"Endoso de \"&G14","v":"Endoso de Cambio de Asegurado/Contratante/Responsable de Pago"},"Auto gestionable"]
[5,"Inclusión","Inclusión",{"$f":"IF(Formato!I16=0,\"Autogestionable\",\"Operación back\")","v":"Operación back"},5,3,"Actualización de Datos","Endoso de Actualización de Datos","Auto gestionable"]
[6,"Rehacer","Rehacer","Operación Back",6,4,"-","Endoso de -","Operación back"]
[7,"Emisión/inclusión de 2 unidades a más","Planilla","Operación Back",7,5,"Constancia de Instalación de GPS",{"$f":"\"Endoso de \"&G17","v":"Endoso de Constancia de Instalación de GPS"},"Operación back"]
[8,"Endosos Múltiples","Planilla Endosos","Operación Back",8,6,"Inspección por Fotos",null,"Operación back"]
[{"$f":"+Formato!I32","v":1},"CONTRATANTE",null,null,null,7,"Anulación de Cesión Derecho","Endoso de Anulación de Cesión Derecho","Operación back"]
[null,"D.N.I.",null,null,null,8,"Modificación de Cesión de Derechos",null,"Auto gestionable con validación"]
[null,"R.U.C.",null,null,null,9,"Prórroga de Póliza",null,"Auto gestionable con validación"]
[null,"C.E.",null,null,null,10,"Prórroga de Certificado","Endoso de Prórroga de Certificado","Auto gestionable con validación"]
[null,"PASAPORTE",null,null,null,11,"Modificación de Año de Vehículo","Endoso de Modificación de Año de Vehículo","Auto gestionable con validación"]
[{"$f":"+Formato!I45","v":1},"rp",null,null,null,12,"Modificación de Suma Asegurada",{"$f":"\"Endoso de \"&G24","v":"Endoso de Modificación de Suma Asegurada"},"Auto gestionable con validación"]
[null,"D.N.I.",null,null,null,13,"Modificación de Cantidad de Ocupantes","Endoso de Modificación de Cantidad de Ocupantes","Auto gestionable con validación"]
[null,"R.U.C.",null,null,null,14,"Modificación de Uso de Vehículo",null,"Auto gestionable con validación"]
[null,"C.E.",null,null,null,15,"Modificación de Clase / Tipo / Marca / Modelo","Endoso de Modificación de Clase / Tipo / Marca / Modelo","Auto gestionable con validación"]
[null,"PASAPORTE",null,null,null,16,"Modificación de Cláusula/Cobertura/Deducible",{"$f":"\"Endoso de \"&G28&\" (Especificar)\"","v":"Endoso de Modificación de Cláusula/Cobertura/Deducible (Especificar)"},"Auto gestionable con validación"]
[1,"ASEGURADO",null,null,null,17,"Rehabilitación de Certificado",{"$f":"\"Endoso de \"&G29","v":"Endoso de Rehabilitación de Certificado"},"Operación back"]
[null,"D.N.I.",null,null,null,18,"Rehabilitación de Póliza",{"$f":"\"Endoso de \"&G30","v":"Endoso de Rehabilitación de Póliza"},"Operación back"]
[null,"R.U.C.",null,null,null,19,"Modificación de Placa/ Motor/ Serie","Endoso de Modificación de Placa/ Motor/ Serie","Auto gestionable"]
[null,"C.E.",null,null,null,20,"_Seleccione_","Endoso de _Seleccione_"]
[null,"PASAPORTE",null,null,null,21,"Condiciones Generales","Endoso de Condiciones Generales","Operación back"]
[null,null,null,null,null,22]
[null,null,null,null,null,23]
[null,null,null,null,null,24]
[null,null,null,null,null,25]
["EL asegurado es igual al contratante :",null,null,null,null,26]
[1,"SI"]
[null,"NO"]
[]
[null,null,null,null,"AUTOMOVIL","AUTOMOVIL","AUTO"]
[null,null,null,null,"CAMION","CAMION","VOLQUETE"]
["EL asegurado es igual al contratante :",null,null,null,"CAMIONETA","CAMION","CAJON"]
[1,"SI",null,null,"CUATRIMOTO","CAMION","BARANDA",null,3]
[null,"NO",null,null,"MICROBUS","CAMION","TRACTO / REMOLCADOR"]
[null,null,null,null,"MINIBUS","CAMION","FURGON"]
[null,null,null,null,"MOTOCICLETA","CAMION","GRUA"]
[" El responsable de pago es igual al asegurado :",null,null,null,"OMNIBUS","CAMION","CONCRETERA (MEZCLADORA)"]
[1,"SI",null,null,"REMOLCADOR","CAMION","PLATAFORMA"]
[null,"NO",null,null,"SEMIREMOLQUE","CAMION","COMPACTADORA"]
[null,null,null,null,"TRIMOTO","CAMION","CAMARA ISOTERMICA"]
[null,null,null,null,null,"CAMION","MEZCLADORA"]
["Vehículo a gas : ",2,null,null,null,"CAMIONETA","RURAL"]
[null,"SI",null,null,null,"CAMIONETA","STATION WAGON"]
[null,"NO",null,null,null,"CAMIONETA","PICK UP 4X2"]
[null,null,null,null,null,"CAMIONETA","PANEL"]
["Vehículo 0 km :",1,null,null,null,"CAMIONETA","VAN"]
[null,"SI",null,null,null,"CAMIONETA","PICK UP 4X4"]
[null,"NO",null,null,null,"CAMIONETA","FURGON"]
{"$rows_left_out":34}